Saint Cloud-n
type: LexicalEntry
canonical form: Saint Cloud
sense: 09125825-n
part of speech: noun

St. Cloud-n
type: LexicalEntry
canonical form: St. Cloud
sense: 09125825-n
part of speech: noun

09125825-n
type: LexicalConcept
in scheme: en-word.net
definition: a town in central Minnesota on the Mississippi River; granite quarries
ili: i84470
lexfile: noun.location
part of speech: noun
instance hypernym: 08683242-n