Sacramento-n
type: LexicalEntry
canonical form: Sacramento
sense: 09087443-n
part of speech: noun

capital of California-n
type: LexicalEntry
canonical form: capital of California
sense: 09087443-n
part of speech: noun

09087443-n
type: LexicalConcept
in scheme: en-word.net
definition: a city in north central California 75 miles to the northeast of San Francisco on the Sacramento River; capital of California
ili: i84258
lexfile: noun.location
part of speech: noun
instance hypernym: 08713353-n