Russia-n
type: LexicalEntry
canonical form: Russia
sense: 09028783-n
part of speech: noun

Russian Federation-n
type: LexicalEntry
canonical form: Russian Federation
sense: 09028783-n
part of speech: noun

09028783-n
type: LexicalConcept
in scheme: en-word.net
definition: a federation in northeastern Europe and northern Asia; formerly Soviet Russia; since 1991 an independent state
ili: i84002
lexfile: noun.location
part of speech: noun
instance hypernym: 08562388-n
mero part: 08797682-n
mero part: 09026438-n
mero part: 09026728-n
mero part: 09026865-n
mero part: 09026995-n
mero part: 09027362-n
mero part: 09027523-n
mero part: 09027643-n
mero part: 09027981-n
mero part: 09028082-n
mero part: 09029841-n
mero part: 09030500-n
mero part: 09030703-n
mero part: 09030824-n
mero part: 09031093-n
mero part: 09031363-n
mero part: 09031544-n
mero part: 09031742-n
mero part: 09031860-n
mero part: 09032063-n
mero part: 09032186-n
mero part: 09032348-n
mero part: 09032455-n
mero part: 09032670-n
mero part: 09032823-n
mero part: 09032935-n
mero part: 09033040-n
mero part: 09033155-n
mero part: 09033344-n
mero part: 09218981-n
mero part: 09291142-n
mero part: 09291684-n
mero part: 09354560-n
mero part: 09354725-n
mero part: 09355504-n
mero part: 09392755-n
mero part: 09481717-n
mero part: 09490315-n
mero part: 09494611-n
mero part: 09496369-n
mero part: 09496527-n