Descartes-n
type: LexicalEntry
canonical form: Descartes
sense: 10951605-n
part of speech: noun

Rene Descartes-n
type: LexicalEntry
canonical form: Rene Descartes
sense: 10951605-n
part of speech: noun

10951605-n
type: LexicalConcept
in scheme: en-word.net
definition: French philosopher and mathematician; developed dualistic theory of mind and matter; introduced the use of coordinates to locate a point in two or three dimensions (1596-1650)
ili: i94906
lexfile: noun.person
part of speech: noun
instance hypernym: 10320928-n
instance hypernym: 10443334-n