Yangon-n
type: LexicalEntry
canonical form: Yangon
sense: 08733610-n
part of speech: noun

Rangoon-n
type: LexicalEntry
canonical form: Rangoon
sense: 08733610-n
part of speech: noun

08733610-n
type: LexicalConcept
in scheme: en-word.net
definition: the former capital and largest city of Myanmar; located in the south near the Irrawaddy river delta
ili: i82702
lexfile: noun.location
part of speech: noun
instance hypernym: 08709407-n