Quapaw-n
type: LexicalEntry
canonical form: Quapaw
sense: 06924832-n
part of speech: noun
sense: 09686679-n

06924832-n
type: LexicalConcept
in scheme: en-word.net
definition: the Dhegiha dialect spoken by the Quapaw
ili: i72848
lexfile: noun.communication
part of speech: noun
hypernym: 06922448-n

09686679-n
type: LexicalConcept
in scheme: en-word.net
definition: a member of the Siouan people of the Arkansas river valley in Arkansas
ili: i87432
lexfile: noun.person
part of speech: noun
hypernym: 09674392-n