Andorra-n
type: LexicalEntry
canonical form: Andorra
sense: 09045488-n
part of speech: noun

Principality of Andorra-n
type: LexicalEntry
canonical form: Principality of Andorra
sense: 09045488-n
part of speech: noun

09045488-n
type: LexicalConcept
in scheme: en-word.net
definition: a small republic in the eastern Pyrenees between Spain and France
ili: i84081
lexfile: noun.location
part of speech: noun
instance hypernym: 08714745-n
mero member: 09709892-n