Persia-n
type: LexicalEntry
canonical form: Persia
sense: 08932615-n
part of speech: noun

Persian Empire-n
type: LexicalEntry
canonical form: Persian Empire
sense: 08932615-n
part of speech: noun

08932615-n
type: LexicalConcept
in scheme: en-word.net
definition: an empire in southern Asia created by Cyrus the Great in the 6th century BC and destroyed by Alexander the Great in the 4th century BC
ili: i83576
lexfile: noun.location
part of speech: noun
instance hypernym: 08575019-n