Shelley-n
type: LexicalEntry
canonical form: Shelley
sense: 11316904-n
part of speech: noun

Percy Bysshe Shelley-n
type: LexicalEntry
canonical form: Percy Bysshe Shelley
sense: 11316904-n
part of speech: noun

11316904-n
type: LexicalConcept
in scheme: en-word.net
definition: Englishman and romantic poet (1792-1822)
ili: i96897
lexfile: noun.person
part of speech: noun
instance hypernym: 10463768-n