Wagner-n
type: LexicalEntry
canonical form: Wagner
sense: 11390063-n
part of speech: noun

Otto Wagner-n
type: LexicalEntry
canonical form: Otto Wagner
sense: 11390063-n
part of speech: noun

11390063-n
type: LexicalConcept
in scheme: en-word.net
definition: Austrian architect and pioneer of modern architecture (1841-1918)
ili: i97322
lexfile: noun.person
part of speech: noun
instance hypernym: 09824898-n