Orange-n
type: LexicalEntry
canonical form: Orange
sense: 09402617-n
part of speech: noun

Orange River-n
type: LexicalEntry
canonical form: Orange River
sense: 09402617-n
part of speech: noun

09402617-n
type: LexicalConcept
in scheme: en-word.net
definition: a river in South Africa that flows generally westward to the Atlantic Ocean
ili: i85915
lexfile: noun.object
part of speech: noun
instance hypernym: 09434308-n