North America-n
type: LexicalEntry
canonical form: North America
sense: 08189929-n
part of speech: noun
sense: 09395415-n

08189929-n
type: LexicalConcept
in scheme: en-word.net
definition: the nations of the North American continent collectively
ili: i80098
lexfile: noun.group
part of speech: noun
hypernym: 07968050-n
mero member: 09757749-n

09395415-n
type: LexicalConcept
in scheme: en-word.net
definition: a continent (the third largest) in the western hemisphere connected to South America by the Isthmus of Panama
ili: i85877
lexfile: noun.object
part of speech: noun
instance hypernym: 09277520-n
mero member: 09744643-n
mero part: 08720619-n
mero part: 08753397-n
mero part: 08753538-n
mero part: 08837973-n
mero part: 09067337-n
mero part: 09271383-n
mero part: 09315917-n
mero part: 09439448-n