Poussin-n
type: LexicalEntry
canonical form: Poussin
sense: 11264755-n
part of speech: noun

Nicolas Poussin-n
type: LexicalEntry
canonical form: Nicolas Poussin
sense: 11264755-n
part of speech: noun

11264755-n
type: LexicalConcept
in scheme: en-word.net
definition: French painter in the classical style (1594-1665)
ili: i96620
lexfile: noun.person
part of speech: noun
instance hypernym: 10395493-n