five-spot-n
type: LexicalEntry
canonical form: five-spot
sense: 12857268-n
part of speech: noun

Nemophila maculata-n
type: LexicalEntry
canonical form: Nemophila maculata
sense: 12857268-n
part of speech: noun

12857268-n
type: LexicalConcept
in scheme: en-word.net
definition: California annual having white flowers with a deep purple blotch on each petal
ili: i104258
lexfile: noun.plant
part of speech: noun
hypernym: 12856972-n