Morgan-n
type: LexicalEntry
canonical form: Morgan
sense: 02381981-n
part of speech: noun
sense: 11210436-n
sense: 11210582-n
sense: 11210764-n
sense: 11210944-n
sense: 11211103-n

02381981-n
type: LexicalConcept
in scheme: en-word.net
definition: an American breed of small compact saddle horses
ili: i48085
lexfile: noun.animal
part of speech: noun
hypernym: 02380355-n

J. P. Morgan-n
type: LexicalEntry
canonical form: J. P. Morgan
sense: 11210436-n
part of speech: noun

John Pierpont Morgan-n
type: LexicalEntry
canonical form: John Pierpont Morgan
sense: 11210436-n
part of speech: noun

11210436-n
type: LexicalConcept
in scheme: en-word.net
definition: United States financier and philanthropist (1837-1913)
ili: i96312
lexfile: noun.person
part of speech: noun
instance hypernym: 10109789-n

Daniel Morgan-n
type: LexicalEntry
canonical form: Daniel Morgan
sense: 11210582-n
part of speech: noun

11210582-n
type: LexicalConcept
in scheme: en-word.net
definition: soldier in the American Revolution who defeated the British in the battle of Cowpens, South Carolina (1736-1802)
ili: i96313
lexfile: noun.person
part of speech: noun
instance hypernym: 10641415-n

Henry Morgan-n
type: LexicalEntry
canonical form: Henry Morgan
sense: 11210764-n
part of speech: noun

Sir Henry Morgan-n
type: LexicalEntry
canonical form: Sir Henry Morgan
sense: 11210764-n
part of speech: noun

11210764-n
type: LexicalConcept
in scheme: en-word.net
definition: a Welsh buccaneer who raided Spanish colonies in the West Indies for the English (1635-1688)
ili: i96314
lexfile: noun.person
part of speech: noun
exemplifies: 06730109-n
instance hypernym: 10455134-n

Thomas Hunt Morgan-n
type: LexicalEntry
canonical form: Thomas Hunt Morgan
sense: 11210944-n
part of speech: noun

11210944-n
type: LexicalConcept
in scheme: en-word.net
definition: United States biologist who formulated the chromosome theory of heredity (1866-1945)
ili: i96315
lexfile: noun.person
part of speech: noun
instance hypernym: 09875036-n

Lewis H. Morgan-n
type: LexicalEntry
canonical form: Lewis H. Morgan
sense: 11211103-n
part of speech: noun

Lewis Henry Morgan-n
type: LexicalEntry
canonical form: Lewis Henry Morgan
sense: 11211103-n
part of speech: noun

11211103-n
type: LexicalConcept
in scheme: en-word.net
definition: United States anthropologist who studied the Seneca (1818-1881)
ili: i96316
lexfile: noun.person
part of speech: noun
instance hypernym: 09815764-n