Mondrian-n
type: LexicalEntry
canonical form: Mondrian
sense: 11205165-n
part of speech: noun

Piet Mondrian-n
type: LexicalEntry
canonical form: Piet Mondrian
sense: 11205165-n
part of speech: noun

11205165-n
type: LexicalConcept
in scheme: en-word.net
definition: Dutch painter whose work (intersecting lines at right angles and planes in primary colors) influenced the development of abstract art (1872-1944)
ili: i96282
lexfile: noun.person
part of speech: noun
instance hypernym: 09777755-n