Michelangelo-n
type: LexicalEntry
canonical form: Michelangelo
sense: 11198151-n
part of speech: noun

Michelangelo Buonarroti-n
type: LexicalEntry
canonical form: Michelangelo Buonarroti
sense: 11198151-n
part of speech: noun

11198151-n
type: LexicalConcept
in scheme: en-word.net
definition: Florentine sculptor and painter and architect; one of the outstanding figures of the Renaissance (1475-1564)
ili: i96239
lexfile: noun.person
part of speech: noun
instance hypernym: 10585500-n
instance hypernym: 10395493-n
instance hypernym: 09824898-n