hooded skunk-n
type: LexicalEntry
canonical form: hooded skunk
sense: 02448983-n
part of speech: noun

Mephitis macroura-n
type: LexicalEntry
canonical form: Mephitis macroura
sense: 02448983-n
part of speech: noun

02448983-n
type: LexicalConcept
in scheme: en-word.net
definition: of Mexico and southernmost parts of southwestern United States
ili: i48504
lexfile: noun.animal
part of speech: noun
hypernym: 02448346-n