Manx-n
type: LexicalEntry
canonical form: Manx
sense: 02127136-n
part of speech: noun

Manx cat-n
type: LexicalEntry
canonical form: Manx cat
sense: 02127136-n
part of speech: noun

02127136-n
type: LexicalConcept
in scheme: en-word.net
definition: a short-haired tailless breed of cat believed to originate on the Isle of Man
ili: i46614
lexfile: noun.animal
part of speech: noun
hypernym: 02124460-n