Malacca-n
type: LexicalEntry
canonical form: Malacca
sense: 08985168-n
part of speech: noun

08985168-n
type: LexicalConcept
in scheme: en-word.net
definition: the third smallest Malaysian state; located in the southern region of the Malay Peninsula
lexfile: noun.location
part of speech: noun
instance hypernym: 08984793-n