Mariehamn-n
type: LexicalEntry
canonical form: Mariehamn
sense: 08798572-n
part of speech: noun

Maarianhamina-n
type: LexicalEntry
canonical form: Maarianhamina
sense: 08798572-n
part of speech: noun

08798572-n
type: LexicalConcept
in scheme: en-word.net
definition: a town that is the chief port of the Aland islands
ili: i83018
lexfile: noun.location
part of speech: noun
instance hypernym: 08683242-n
instance hypernym: 08651532-n