Louvre-n
type: LexicalEntry
canonical form: Louvre
sense: 03698268-n
part of speech: noun

Louvre Museum-n
type: LexicalEntry
canonical form: Louvre Museum
sense: 03698268-n
part of speech: noun

03698268-n
type: LexicalConcept
in scheme: en-word.net
definition: an art museum that is a famous tourist attraction in Paris
ili: i55841
lexfile: noun.artifact
part of speech: noun
instance hypernym: 03806085-n