Louis I-n
type: LexicalEntry
canonical form: Louis I
sense: 11159082-n
part of speech: noun

Louis the Pious-n
type: LexicalEntry
canonical form: Louis the Pious
sense: 11159082-n
part of speech: noun

11159082-n
type: LexicalConcept
in scheme: en-word.net
definition: third son of Charlemagne and king of France and Germany and Holy Roman Emperor (778-840)
ili: i96010
lexfile: noun.person
part of speech: noun
instance hypernym: 10254037-n