Lobito-n
type: LexicalEntry
canonical form: Lobito
sense: 08726442-n
part of speech: noun

08726442-n
type: LexicalConcept
in scheme: en-word.net
definition: a seaport on the Atlantic coast of Angola
ili: i82667
lexfile: noun.location
part of speech: noun
instance hypernym: 08542298-n
instance hypernym: 08651532-n