Lhasa-n
type: LexicalEntry
canonical form: Lhasa
sense: 02101065-n
part of speech: noun

Lhasa apso-n
type: LexicalEntry
canonical form: Lhasa apso
sense: 02101065-n
part of speech: noun

02101065-n
type: LexicalConcept
in scheme: en-word.net
definition: a breed of terrier having a long heavy coat raised in Tibet as watchdogs
ili: i46450
lexfile: noun.animal
part of speech: noun
hypernym: 02095120-n