Lao-a
type: LexicalEntry
canonical form: Lao
sense: https://en-word.net/lemma/Lao-a#03091231-a
part of speech: adjective

https://en-word.net/synset/03091231-a
type: LexicalConcept
in scheme: en-word.net
definition: of or relating to a member of the Buddhist people inhabiting the Mekong river in Laos and Thailand
ili: i17653
lexfile: adj.pert
part of speech: adjective

Lao-n
type: LexicalEntry
canonical form: Lao
sense: 06948371-n
part of speech: noun
sense: 09739190-n

Lao language-n
type: LexicalEntry
canonical form: Lao language
sense: 06948371-n
part of speech: noun

06948371-n
type: LexicalConcept
in scheme: en-word.net
definition: the Tai language of a Buddhist people living in the area of the Mekong River in Thailand and Laos
ili: i73028
lexfile: noun.communication
part of speech: noun
hypernym: 06947166-n

Laotian-n
type: LexicalEntry
canonical form: Laotian
sense: 09739190-n
part of speech: noun

09739190-n
type: LexicalConcept
in scheme: en-word.net
definition: a member of a Buddhist people inhabiting the area of the Mekong River in Laos and Thailand and speaking the Lao language; related to the Thais
ili: i87762
lexfile: noun.person
part of speech: noun
hypernym: 09662736-n