Lake Mead-n
type: LexicalEntry
canonical form: Lake Mead
sense: 03639480-n
part of speech: noun

03639480-n
type: LexicalConcept
in scheme: en-word.net
definition: the largest reservoir in the United States; located in southeastern Nevada and northwestern Arizona and formed by the Hoover Dam on the Colorado River; the center of a recreational area
ili: i55485
lexfile: noun.artifact
part of speech: noun
instance hypernym: 04085859-n