Kendal green-n
type: LexicalEntry
canonical form: Kendal green
sense: 15013528-n
part of speech: noun

Kendal-n
type: LexicalEntry
canonical form: Kendal
sense: 15013528-n
part of speech: noun

15013528-n
type: LexicalConcept
in scheme: en-word.net
definition: a green dye, often used to color cloth, which is obtained from the woad plant
ili: i115914
lexfile: noun.substance
part of speech: noun
hypernym: 15009942-n