Porter-n
type: LexicalEntry
canonical form: Porter
sense: 11263414-n
part of speech: noun

Katherine Anne Porter-n
type: LexicalEntry
canonical form: Katherine Anne Porter
sense: 11263414-n
part of speech: noun

11263414-n
type: LexicalConcept
in scheme: en-word.net
definition: United States writer of novels and short stories (1890-1980)
ili: i96613
lexfile: noun.person
part of speech: noun
instance hypernym: 10813654-n