Kansas City-n
type: LexicalEntry
canonical form: Kansas City
sense: 09110954-n
part of speech: noun
sense: 09129720-n

09110954-n
type: LexicalConcept
in scheme: en-word.net
definition: a city of northeast Kansas on the Missouri River adjacent to Kansas City, Missouri
ili: i84387
lexfile: noun.location
part of speech: noun
instance hypernym: 08542298-n

09129720-n
type: LexicalConcept
in scheme: en-word.net
definition: a city in western Missouri situated at the confluence of the Kansas River and the Missouri River; adjacent to Kansas City, Kansas
ili: i84490
lexfile: noun.location
part of speech: noun
instance hypernym: 08542298-n