James-n
type: LexicalEntry
canonical form: James
sense: 11099534-n
part of speech: noun

Jesse James-n
type: LexicalEntry
canonical form: Jesse James
sense: 11099534-n
part of speech: noun

11099534-n
type: LexicalConcept
in scheme: en-word.net
definition: United States outlaw who fought as a Confederate soldier and later led a band of outlaws that robbed trains and banks in the West until he was murdered by a member of his own gang (1847-1882)
ili: i95694
lexfile: noun.person
part of speech: noun
exemplifies: 06730109-n
instance hypernym: 09997190-n