James-n
type: LexicalEntry
canonical form: James
sense: 09343891-n
part of speech: noun
sense: 09344086-n

James River-n
type: LexicalEntry
canonical form: James River
sense: 09343891-n
part of speech: noun
sense: 09344086-n

09343891-n
type: LexicalConcept
in scheme: en-word.net
definition: a river that rises in North Dakota and flows southward across South Dakota to the Missouri
ili: i85606
lexfile: noun.object
part of speech: noun
instance hypernym: 09434308-n

09344086-n
type: LexicalConcept
in scheme: en-word.net
definition: a river in Virginia that flows east into Chesapeake Bay at Hampton Roads
ili: i85607
lexfile: noun.object
part of speech: noun
instance hypernym: 09434308-n