Calvino-n
type: LexicalEntry
canonical form: Calvino
sense: 10900593-n
part of speech: noun

Italo Calvino-n
type: LexicalEntry
canonical form: Italo Calvino
sense: 10900593-n
part of speech: noun

10900593-n
type: LexicalConcept
in scheme: en-word.net
definition: Italian writer of novels and short stories (born in Cuba) (1923-1987)
ili: i94634
lexfile: noun.person
part of speech: noun
instance hypernym: 10813654-n