Hesse-n
type: LexicalEntry
canonical form: Hesse
sense: 11068200-n
part of speech: noun

Hermann Hesse-n
type: LexicalEntry
canonical form: Hermann Hesse
sense: 11068200-n
part of speech: noun

11068200-n
type: LexicalConcept
in scheme: en-word.net
definition: Swiss writer (born in Germany) whose novels and poems express his interests in eastern spiritual values (1877-1962)
ili: i95517
lexfile: noun.person
part of speech: noun
instance hypernym: 10813654-n