James-n
type: LexicalEntry
canonical form: James
sense: 11099242-n
part of speech: noun

Henry James-n
type: LexicalEntry
canonical form: Henry James
sense: 11099242-n
part of speech: noun

11099242-n
type: LexicalConcept
in scheme: en-word.net
definition: writer who was born in the United States but lived in England (1843-1916)
ili: i95692
lexfile: noun.person
part of speech: noun
instance hypernym: 10813654-n