Bruno-n
type: LexicalEntry
canonical form: Bruno
sense: 10888325-n
part of speech: noun

Giordano Bruno-n
type: LexicalEntry
canonical form: Giordano Bruno
sense: 10888325-n
part of speech: noun

10888325-n
type: LexicalConcept
in scheme: en-word.net
definition: Italian philosopher who used Copernican principles to develop a pantheistic monistic philosophy; condemned for heresy by the Inquisition and burned at the stake (1548-1600)
ili: i94572
lexfile: noun.person
part of speech: noun
instance hypernym: 10443334-n