Carver-n
type: LexicalEntry
canonical form: Carver
sense: 10905355-n
part of speech: noun

George Washington Carver-n
type: LexicalEntry
canonical form: George Washington Carver
sense: 10905355-n
part of speech: noun

10905355-n
type: LexicalConcept
in scheme: en-word.net
definition: United States botanist and agricultural chemist who developed many uses for peanuts and soy beans and sweet potatoes (1864-1943)
ili: i94662
lexfile: noun.person
part of speech: noun
instance hypernym: 09887676-n
instance hypernym: 09933282-n