French-a
type: LexicalEntry
canonical form: French
sense: https://en-word.net/lemma/French-a#02969938-a
part of speech: adjective

Gallic-a
type: LexicalEntry
canonical form: Gallic
sense: https://en-word.net/lemma/Gallic-a#02969938-a
part of speech: adjective
sense: https://en-word.net/lemma/Gallic-a#03078406-a

https://en-word.net/synset/02969938-a
type: LexicalConcept
in scheme: en-word.net
definition: of or pertaining to France or the people of France
example: French cooking
example: a Gallic shrug
ili: i16872
lexfile: adj.pert
part of speech: adjective

https://en-word.net/synset/03078406-a
type: LexicalConcept
in scheme: en-word.net
definition: of or pertaining to Gaul or the Gauls
example: Ancient Gallic dialects
example: Gallic migrations
example: the Gallic Wars
ili: i17577
lexfile: adj.pert
part of speech: adjective