Federal Bureau of Investigation-n
type: LexicalEntry
canonical form: Federal Bureau of Investigation
sense: 08153242-n
part of speech: noun

FBI-n
type: LexicalEntry
canonical form: FBI
sense: 08153242-n
part of speech: noun

08153242-n
type: LexicalConcept
in scheme: en-word.net
definition: a federal law enforcement agency that is the principal investigative arm of the Department of Justice
ili: i79924
lexfile: noun.group
part of speech: noun
domain topic: 08458195-n
hypernym: 08365742-n