Braun-n
type: LexicalEntry
canonical form: Braun
sense: 10883036-n
part of speech: noun

Eva Braun-n
type: LexicalEntry
canonical form: Eva Braun
sense: 10883036-n
part of speech: noun

10883036-n
type: LexicalConcept
in scheme: en-word.net
definition: the German mistress of Adolf Hitler (1910-1945)
ili: i94542
lexfile: noun.person
part of speech: noun
instance hypernym: 10343410-n