Ethiopian-a
type: LexicalEntry
canonical form: Ethiopian
sense: https://en-word.net/lemma/Ethiopian-a#03076098-a
part of speech: adjective

https://en-word.net/synset/03076098-a
type: LexicalConcept
in scheme: en-word.net
definition: of or relating to or characteristic of Ethiopia or its people or languages
example: Ethiopian immigrants
ili: i17564
lexfile: adj.pert
part of speech: adjective

Ethiopian-n
type: LexicalEntry
canonical form: Ethiopian
sense: 09724520-n
part of speech: noun

09724520-n
type: LexicalConcept
in scheme: en-word.net
definition: a native or inhabitant of Ethiopia
ili: i87664
lexfile: noun.person
part of speech: noun
hypernym: 09657682-n