Buchner-n
type: LexicalEntry
canonical form: Buchner
sense: 10889659-n
part of speech: noun

Eduard Buchner-n
type: LexicalEntry
canonical form: Eduard Buchner
sense: 10889659-n
part of speech: noun

10889659-n
type: LexicalConcept
in scheme: en-word.net
definition: German organic chemist who studied alcoholic fermentation and discovered zymase (1860-1917)
ili: i94578
lexfile: noun.person
part of speech: noun
instance hypernym: 09933282-n