East Timor-n
type: LexicalEntry
canonical form: East Timor
sense: 08794268-n
part of speech: noun

08794268-n
type: LexicalConcept
in scheme: en-word.net
definition: a former Portuguese colony that was annexed by Indonesia in 1976; voted for independence from Indonesia in 1999 and in May 2002 became an independent nation
ili: i82997
lexfile: noun.location
part of speech: noun
instance hypernym: 08562388-n