Dylan ail Don-n
type: LexicalEntry
canonical form: Dylan ail Don
sense: 09532251-n
part of speech: noun

Dylan-n
type: LexicalEntry
canonical form: Dylan
sense: 09532251-n
part of speech: noun

09532251-n
type: LexicalConcept
in scheme: en-word.net
definition: Celtic god of the waves; son of Arianrhod
ili: i86589
lexfile: noun.person
part of speech: noun
domain region: 08914683-n
instance hypernym: 09530229-n