Dubrovnik-n
type: LexicalEntry
canonical form: Dubrovnik
sense: 08836687-n
part of speech: noun

Ragusa-n
type: LexicalEntry
canonical form: Ragusa
sense: 08836687-n
part of speech: noun

08836687-n
type: LexicalConcept
in scheme: en-word.net
definition: a port city in southwestern Croatia on the Adriatic; a popular tourist center
ili: i83185
lexfile: noun.location
part of speech: noun
instance hypernym: 08542298-n
instance hypernym: 08651532-n