Dortmund-n
type: LexicalEntry
canonical form: Dortmund
sense: 08788551-n
part of speech: noun

08788551-n
type: LexicalConcept
in scheme: en-word.net
definition: an industrial city in northwestern Germany; flourished from the 13th to 17th century as a member of the Hanseatic League
ili: i82965
lexfile: noun.location
part of speech: noun
instance hypernym: 08542298-n