Defoe-n
type: LexicalEntry
canonical form: Defoe
sense: 10947021-n
part of speech: noun

Daniel Defoe-n
type: LexicalEntry
canonical form: Daniel Defoe
sense: 10947021-n
part of speech: noun

10947021-n
type: LexicalConcept
in scheme: en-word.net
definition: English writer remembered particularly for his novel about Robinson Crusoe (1659-1731)
ili: i94880
lexfile: noun.person
part of speech: noun
instance hypernym: 10813654-n