Cordoba-n
type: LexicalEntry
canonical form: Cordoba
sense: 08730969-n
part of speech: noun
sense: 09048098-n
sense: 10930521-n

Cordova-n
type: LexicalEntry
canonical form: Cordova
sense: 08730969-n
part of speech: noun
sense: 09048098-n
sense: 10930521-n

08730969-n
type: LexicalConcept
in scheme: en-word.net
definition: a city in central Argentina; site of a university founded in 1613
ili: i82689
lexfile: noun.location
part of speech: noun
instance hypernym: 08542298-n

09048098-n
type: LexicalConcept
in scheme: en-word.net
definition: a city in southern Spain; center of Moorish culture
ili: i84090
lexfile: noun.location
part of speech: noun
instance hypernym: 08542298-n

Francisco Fernandez Cordoba-n
type: LexicalEntry
canonical form: Francisco Fernandez Cordoba
sense: 10930521-n
part of speech: noun

Francisco Fernandez de Cordova-n
type: LexicalEntry
canonical form: Francisco Fernandez de Cordova
sense: 10930521-n
part of speech: noun

10930521-n
type: LexicalConcept
in scheme: en-word.net
definition: Spanish explorer who discovered Yucatan (1475-1526)
ili: i94790
lexfile: noun.person
part of speech: noun
instance hypernym: 10092496-n