Clovis-n
type: LexicalEntry
canonical form: Clovis
sense: 10922924-n
part of speech: noun

Clovis I-n
type: LexicalEntry
canonical form: Clovis I
sense: 10922924-n
part of speech: noun

10922924-n
type: LexicalConcept
in scheme: en-word.net
definition: king of the Franks who unified Gaul and established his capital at Paris and founded the Frankish monarchy; his name was rendered as Gallic ‘Louis’ (466-511)
ili: i94751
lexfile: noun.person
part of speech: noun
instance hypernym: 10251212-n
instance hypernym: 09708200-n