Clinton-n
type: LexicalEntry
canonical form: Clinton
sense: 09109445-n
part of speech: noun
sense: 10922161-n
sense: 10922343-n
sense: 10922504-n

09109445-n
type: LexicalConcept
in scheme: en-word.net
definition: a town in east central Iowa
ili: i84377
lexfile: noun.location
part of speech: noun
instance hypernym: 08683242-n

DeWitt Clinton-n
type: LexicalEntry
canonical form: DeWitt Clinton
sense: 10922161-n
part of speech: noun

10922161-n
type: LexicalConcept
in scheme: en-word.net
definition: United States politician who as governor of New York supported the project to build the Erie Canal (1769-1828)
ili: i94747
lexfile: noun.person
part of speech: noun
instance hypernym: 10469877-n

Bill Clinton-n
type: LexicalEntry
canonical form: Bill Clinton
sense: 10922343-n
part of speech: noun

William Jefferson Clinton-n
type: LexicalEntry
canonical form: William Jefferson Clinton
sense: 10922343-n
part of speech: noun

President Clinton-n
type: LexicalEntry
canonical form: President Clinton
sense: 10922343-n
part of speech: noun

10922343-n
type: LexicalConcept
in scheme: en-word.net
definition: 42nd President of the United States (1946-)
ili: i94748
lexfile: noun.person
part of speech: noun
instance hypernym: 10486961-n

Hillary Clinton-n
type: LexicalEntry
canonical form: Hillary Clinton
sense: 10922504-n
part of speech: noun

Hillary Rodham Clinton-n
type: LexicalEntry
canonical form: Hillary Rodham Clinton
sense: 10922504-n
part of speech: noun

10922504-n
type: LexicalConcept
in scheme: en-word.net
definition: wife of President Clinton and later a woman member of the United States Senate (1947-)
ili: i94749
lexfile: noun.person
part of speech: noun
instance hypernym: 10597923-n